Order__,Patient__,Date,Day,Time,Training_Level,Type_Training,Antibiotic,PtAge,GestAge,Birthwt,PtWt,Renal_Dys,PICC_10d,HemInst,__by_c_s,Comments__Section_1_,Pt_Name,MRN,PtWt1,Date1,Time1,DrugName,Dose,Route,Frequen,Mg_Kg,Signature,Pager,Comments__Section_2_,PractDose,Dec_Zero,Med_Abb,Route_Abb,Sched_Abb,Legible,DOB_age,Comments__Section_3_,Order_with_Omission,Total___Omissions,Overdose,Underdose,Sched,Duplicate,WrongAbx,STAT,WrongRoute,Drug_Drug,Drug_Dz,Contraind,OtherError,Comments__Section_4_,Definition_of_Prescribing_Errors,Definition_of_Potential_Errors,Definition_of_Omission,datind,ptid,On_line,_,VAR55,VAR56,VAR57,VAR58,VAR59,VAR60,prescerror,nprescerror,overdose_error,underdose_error,sched_error,route_error,duplicate_error,abx_error,drugdrug_error,drugdz_error,contraind_error,other_error,mgkg_error,ptname_error,mrn_error,ptwt_error,dob_error,poterror,npoterror,omission,nomissions,anyerror,nerrors,PtWt_binary,Date_binary,Mg_Kg_binary,Dec_Zero_three,DOB_age_binary,Overdose_binary,Sched_binary,Physician_Ind,Antibiotic_class
21,9,07/14/2006,4,0,1,1,7,51,25,690,1275,0,0,0,0,,1,1,1,1,1,1,1,1,1,2,1,1,"really 28 mg/kg/dose, not 25 mg/kg",1,0,0,1,2,1,1,Sched abb o for hours,0,0,0,0,2,0,0,0,0,0,0,0,0,q 8h should have been q 6h; *nafcillin used in pt with elevated dbili,,,,1,9,,,,,,,,,1,2,0,0,1,0,0,0,0,0,0,0,1,0,0,0,0,1,1,0,0,1,3,1,1,0,0,1,1,0,1,1
22,9,07/14/2006,4,0,1,1,1,51,25,690,1275,0,0,0,0,,1,1,1,1,1,1,1,1,1,1,1,1,,1,1,0,1,2,1,1,Sched abb o for hours,0,0,0,0,0,0,0,0,0,0,0,0,0,,,,,1,9,,,,,,,,,0,0,0,0,0,0,0,0,0,0,0,0,0,0,0,0,0,1,1,0,0,1,1,1,1,1,1,1,1,1,1,1
4,13,07/09/2006,6,1,0,3,8,49,25,714,1300,0,0,0,0,questionable NEC,1,1,1,1,1,1,1,1,1,1,1,1,,1,0,0,1,2,1,1,Sched abb o for hours,0,0,0,1,2,0,0,0,0,0,0,0,0,15 mg/kg/day divided q 12 hours should be 20 mg/kg/day divided q 6 hours,Duplicate (yes),Route Abb (error prone),Date (no),1,13,,,,,,,,,1,2,0,1,1,0,0,0,0,0,0,0,0,0,0,0,0,1,1,0,0,1,3,1,1,1,0,1,1,0,0,0
5,13,07/09/2006,6,1,0,3,2,49,25,714,1300,0,0,0,0,questionable NEC,1,1,1,1,1,1,1,1,1,1,1,1,,1,0,0,1,2,1,1,Sched abb o for hours,0,0,0,0,0,0,0,1,0,0,0,0,0,"underdosed, but h/o correct level on this dose; inappropriate choice of abx but h/o MRSA line infection",WrongAbx (yes),Sched Abb (error prone),Time (no),1,13,,,,,,,,,0,0,0,0,0,0,0,0,0,0,0,0,0,0,0,0,0,1,2,0,0,1,2,1,1,1,0,1,1,1,0,1
6,13,07/09/2006,6,1,0,3,1,49,25,714,1300,0,0,0,0,questionable NEC,1,1,1,1,1,1,1,1,1,1,1,1,,1,0,0,1,2,1,1,Sched abb o for hours,0,0,0,0,2,0,0,1,0,0,0,0,0,ordered q 12h- should be q 8h,WrongRoute (yes),Legible (no),DrugName (no),1,13,,,,,,,,,1,1,0,0,1,0,0,0,0,0,0,0,0,0,0,0,0,1,2,0,0,1,3,1,1,1,0,1,1,0,0,1
35,13,07/24/2006,0,0,0,3,9,64,25,714,1585,0,0,0,0,,1,1,1,1,1,1,1,1,1,1,1,1,,1,0,0,1,2,1,1,Sched abb o for hours,0,0,0,0,0,0,0,0,0,0,0,0,0,,,,,1,13,,,,,,,,,0,0,0,0,0,0,0,0,0,0,0,0,0,0,0,0,0,1,1,0,0,1,1,1,1,1,0,1,1,1,0,0
36,13,07/23/2006,6,1,0,3,2,63,25,714,1655,0,0,0,0,"MRSA, abscess",1,1,1,1,1,1,1,1,1,1,1,1,,1,0,0,1,2,1,1,Sched abb o for hours,0,0,0,1,2,0,0,0,0,0,0,0,0,"30 mg/kg/day, should be 40 mg/kg/day; q 8h should be q 6h",,,,1,13,,,,,,,,,1,2,0,1,1,0,0,0,0,0,0,0,0,0,0,0,0,1,1,0,0,1,3,1,1,1,0,1,1,0,0,1
37,13,07/23/2006,6,1,0,3,3,63,25,714,1655,0,0,0,0,,1,1,1,1,1,1,1,1,1,1,1,1,,1,0,0,1,2,1,1,Sched abb o for hours,0,0,0,0,0,0,0,0,0,0,0,0,0,,,,,1,13,,,,,,,,,0,0,0,0,0,0,0,0,0,0,0,0,0,0,0,0,0,1,1,0,0,1,1,1,1,1,0,1,1,1,0,1
38,13,07/23/2006,6,1,0,3,2,63,25,714,1655,0,0,0,0,"MRSA, abscess",1,1,1,1,1,1,1,1,1,1,1,1,,1,0,0,1,1,1,1,,0,0,0,1,2,0,0,0,0,0,0,0,0,"30 mg/kg/day, should be 40 mg/kg/day; q 12h should be q 6h",,,,1,13,,,,,,,,,1,2,0,1,1,0,0,0,0,0,0,0,0,0,0,0,0,0,0,0,0,1,2,1,1,1,0,1,1,0,0,1
56,13,08/03/2006,3,0,0,3,9,74,25,714,2025,0,0,0,1,negative culture,1,1,0,1,1,1,1,1,1,3,1,1,mg/kg not noted as per day or per dose,1,0,0,1,1,1,1,,1,1,0,0,0,0,0,0,0,0,0,0,0,no pt weight,,,,1,13,,,,,,,,,0,0,0,0,0,0,0,0,0,0,0,0,0,0,0,0,0,0,0,1,2,1,2,0,1,0,0,1,1,1,0,0
113,13,08/18/2006,4,0,0,3,2,90,25,714,2265,0,1,0,0,"r/o NEC, 25d linazolid for MRSA osteo",1,1,1,1,1,1,1,1,1,1,1,1,,1,0,0,1,2,1,1,Sched abb o for hours,0,0,0,0,0,0,0,0,0,0,0,0,0,,,,,1,13,,,,,,,,,0,0,0,0,0,0,0,0,0,0,0,0,0,0,0,0,0,1,1,0,0,1,1,1,1,1,0,1,1,1,0,1
114,13,08/18/2006,4,0,0,3,3,90,25,714,2265,0,1,0,0,"r/o NEC, 25d linazolid for MRSA osteo",1,1,1,1,1,1,1,1,1,1,1,1,,1,0,0,1,2,1,1,Sched abb o for hours,0,0,0,0,0,0,0,0,0,0,0,0,0,,,,,1,13,,,,,,,,,0,0,0,0,0,0,0,0,0,0,0,0,0,0,0,0,0,1,1,0,0,1,1,1,1,1,0,1,1,1,0,1
115,13,08/18/2006,4,0,0,3,4,90,25,714,2265,0,1,0,0,"r/o NEC, 25d linazolid for MRSA osteo",1,1,1,1,1,1,1,1,1,1,1,1,,1,0,0,1,2,1,1,Sched abb o for hours,0,0,0,0,0,0,0,0,0,0,0,0,0,,,,,1,13,,,,,,,,,0,0,0,0,0,0,0,0,0,0,0,0,0,0,0,0,0,1,1,0,0,1,1,1,1,1,0,1,1,1,0,1
116,13,08/18/2006,4,0,0,3,1,90,25,714,2265,0,1,0,0,"r/o NEC, 25d linazolid for MRSA osteo",1,1,1,1,1,2,1,1,1,1,1,1,name of drug misspelled,1,1,0,1,2,1,1,Sched abb o for hours,0,0,0,0,0,0,0,0,0,0,0,0,0,,,,,1,13,,,,,,,,,0,0,0,0,0,0,0,0,0,0,0,0,0,0,0,0,0,1,2,0,0,1,2,1,1,1,1,1,1,1,0,1
14,28,07/05/2006,2,1,0,3,2,27,37,2355,2750,0,1,0,0,,1,1,1,1,1,1,1,1,1,1,1,1,,1,0,0,1,1,1,1,,0,0,0,0,0,0,0,0,0,0,0,0,0,,PtWt (incorrect),,,1,28,,,,,,,,,0,0,0,0,0,0,0,0,0,0,0,0,0,0,0,0,0,0,0,0,0,0,0,1,1,1,0,1,1,1,0,1
15,28,07/05/2006,2,1,0,3,3,27,37,2355,2750,0,1,0,0,,1,1,1,1,1,1,1,1,1,1,1,1,,1,0,0,1,1,1,1,,0,0,0,0,0,0,0,0,0,0,0,0,0,,DOB/Age (incorrect),,,1,28,,,,,,,,,0,0,0,0,0,0,0,0,0,0,0,0,0,0,0,0,0,0,0,0,0,0,0,1,1,1,0,1,1,1,0,1
27,17,07/16/2006,6,1,0,3,7,31,27,970,1400,0,0,0,0,discussed interval,1,1,1,1,1,1,1,1,1,1,1,1,,1,0,0,1,1,1,1,,0,0,0,0,0,0,0,0,0,0,0,0,0,,,,,1,17,,,,,,,,,0,0,0,0,0,0,0,0,0,0,0,0,0,0,0,0,0,0,0,0,0,0,0,1,1,1,0,1,1,1,0,1
28,17,07/16/2006,6,1,0,3,1,31,27,970,1400,0,0,0,0,,1,1,1,1,1,1,1,1,1,1,1,1,,1,1,0,1,1,1,1,,0,0,0,0,0,0,0,0,0,0,0,0,0,,,,,1,17,,,,,,,,,0,0,0,0,0,0,0,0,0,0,0,0,0,0,0,0,0,0,0,0,0,0,0,1,1,1,1,1,1,1,0,1
29,17,07/27/2006,3,0,0,3,7,42,27,970,1670,0,0,0,0,,1,1,1,1,1,1,1,1,1,1,1,0,missing pager #,1,0,0,1,2,1,1,Sched abb o for hours,1,1,0,0,2,0,0,0,0,0,0,0,0,omitted pager #; should be q 6 hr instead of q 8h,,,,1,17,,,,,,,,,1,1,0,0,1,0,0,0,0,0,0,0,0,0,0,0,0,1,1,1,1,1,3,1,1,1,0,1,1,0,0,1
30,17,07/27/2006,3,0,0,3,1,42,27,970,1670,0,0,0,0,,1,1,1,1,1,1,1,1,1,1,1,0,missing pager #,1,0,0,1,2,1,1,Sched abb o for hours,1,1,0,0,2,0,0,0,0,0,0,0,0,omitted pager #; should be q 8 hr instead of q 12h,,,,1,17,,,,,,,,,1,1,0,0,1,0,0,0,0,0,0,0,0,0,0,0,0,1,1,1,1,1,3,1,1,1,0,1,1,0,0,1
127,17,07/27/2006,3,1,0,3,2,43,27,970,1670,0,0,0,0,,1,1,1,1,1,1,1,1,1,1,1,1,,0,1,0,1,1,0,1,12.7 mg Vanc; pager #,0,0,0,0,0,0,0,1,0,0,0,0,0,,,,,1,17,,,,,,,,,0,0,0,0,0,0,0,0,0,0,0,0,0,0,0,0,0,1,3,0,0,1,3,1,1,1,1,1,1,1,0,1
2,10,07/08/2006,5,1,0,3,7,23,26,705,840,0,0,0,0,,1,1,1,2,1,1,1,1,1,1,1,1,,1,0,0,1,2,1,1,Sched abb o for hours,0,0,1,0,0,0,0,0,0,0,0,0,0,50 mg/kg/dose instead of per day,Underdoses (yes),Dec/Zero (leading decim,MRN (no),1,10,,,,,,,,,1,1,1,0,0,0,0,0,0,0,0,0,0,0,0,0,0,1,2,0,0,1,3,1,0,1,0,1,0,1,0,1
3,10,07/08/2006,5,1,0,3,1,23,26,705,840,0,0,0,0,,1,1,1,2,1,1,1,1,1,1,1,1,,1,0,0,1,2,1,1,Sched abb o for hours,0,0,0,0,0,0,0,0,0,0,0,0,0,,Sched (Too frequent,Med Abb (error prone),PtWt (no),1,10,,,,,,,,,0,0,0,0,0,0,0,0,0,0,0,0,0,0,0,0,0,1,2,0,0,1,2,1,0,1,0,1,1,1,0,1
23,12,07/14/2006,4,0,2,1,7,23,24,710,830,0,0,0,0,,1,1,1,1,1,1,1,1,1,1,1,1,,1,0,0,1,1,1,1,,0,0,0,0,0,0,0,0,0,0,0,0,0,,,,,1,12,,,,,,,,,0,0,0,0,0,0,0,0,0,0,0,0,0,0,0,0,0,0,0,0,0,0,0,1,1,1,0,1,1,1,1,1
24,12,07/14/2006,4,0,2,1,1,23,24,710,830,0,0,0,0,,1,1,1,1,1,1,1,1,1,1,1,1,,1,1,0,1,1,1,1,,0,0,0,0,0,0,0,0,0,0,0,0,0,,,,,1,12,,,,,,,,,0,0,0,0,0,0,0,0,0,0,0,0,0,0,0,0,0,0,0,0,0,0,0,1,1,1,1,1,1,1,1,1
90,12,08/15/2006,1,0,2,1,2,55,24,710,1240,0,0,0,0,r/o NEC,1,1,1,1,1,1,1,1,1,1,1,1,,1,0,0,1,1,1,1,,0,0,0,1,2,0,0,0,0,0,0,0,0,15 mg/kg/day should be 40 mg/kg/day; daily dose should be divided q 6-8h not q24h,,,,1,12,,,,,,,,,1,2,0,1,1,0,0,0,0,0,0,0,0,0,0,0,0,0,0,0,0,1,2,1,1,1,0,1,1,0,1,1
91,12,08/15/2006,1,0,2,1,3,55,24,710,1240,0,0,0,0,r/o NEC,1,1,1,1,1,1,0,0,0,0,1,1,,1,0,0,0,0,1,1,,1,3,0,0,0,0,0,0,0,0,0,0,0,"no dose, route, frequency, dosage calculation",,,,1,12,,,,,,,,,0,0,0,0,0,0,0,0,0,0,0,0,0,0,0,0,0,0,0,1,4,1,4,1,1,0,0,1,1,1,1,1
92,12,08/15/2006,1,0,2,1,3,55,24,710,1240,0,0,0,0,r/o NEC,1,1,1,1,1,1,1,1,1,1,1,1,,1,0,0,1,2,1,1,Sched abb o for hours,0,0,0,0,0,0,0,0,0,0,0,0,0,,,,,1,12,,,,,,,,,0,0,0,0,0,0,0,0,0,0,0,0,0,0,0,0,0,1,1,0,0,1,1,1,1,1,0,1,1,1,1,1
93,12,08/15/2006,1,0,2,1,2,55,24,710,1240,0,0,0,0,r/o NEC,1,1,1,1,1,1,1,1,1,1,1,1,,1,0,0,1,2,1,1,Sched abb o for hours,0,0,0,0,0,0,0,0,0,0,0,0,0,,,,,1,12,,,,,,,,,0,0,0,0,0,0,0,0,0,0,0,0,0,0,0,0,0,1,1,0,0,1,1,1,1,1,0,1,1,1,1,1
94,12,08/16/2006,2,0,0,3,2,56,24,710,1255,0,0,0,0,r/o NEC,1,1,1,1,1,1,1,1,1,1,1,1,,0,1,0,1,1,0,1,18.7mg Vanc; poor leg,0,0,0,1,2,0,0,0,0,0,0,0,0,30 mg/kg/day instead of 40 mg/kg/day; q 12 instead of q 6-8 hr,,,,1,12,,,,,,,,,1,2,0,1,1,0,0,0,0,0,0,0,0,0,0,0,0,1,2,0,0,1,4,1,1,1,1,1,1,0,0,1
1,15,07/10/2006,0,0,0,3,2,14,26,1019,1000,0,0,0,1,,1,1,1,1,1,1,1,1,1,1,1,1,,1,0,0,1,2,1,1,Sched abb o for hours,0,0,0,0,0,0,0,0,0,0,0,0,0,,Overdoses (incorr e,PractDose (no),Pt Name (no),1,15,,,,,,,,,0,0,0,0,0,0,0,0,0,0,0,0,0,0,0,0,0,1,1,0,0,1,1,1,1,1,0,1,1,1,0,1
7,15,07/09/2006,6,1,0,3,7,13,26,1019,1000,0,1,0,0,,1,1,1,1,1,1,1,1,1,1,1,1,,1,0,0,1,2,1,1,Sched abb o for hours,0,0,0,0,0,0,1,0,0,0,0,0,0,PICC in 10 days- should have gotten Vanc,Drug-Drug (yes),STAT (no),Dose (no),1,15,,,,,,,,,1,1,0,0,0,0,0,1,0,0,0,0,0,0,0,0,0,1,1,0,0,1,2,1,1,1,0,1,1,1,0,1
8,15,07/09/2006,6,1,0,3,1,13,26,1019,1000,0,1,0,0,,1,1,1,1,1,1,1,1,1,1,1,1,,1,0,0,1,2,1,1,Sched abb o for hours,0,0,0,0,0,0,0,0,0,0,0,0,0,,Drug-Dz (yes),DrugName (misspelled),Route (no),1,15,,,,,,,,,0,0,0,0,0,0,0,0,0,0,0,0,0,0,0,0,0,1,1,0,0,1,1,1,1,1,0,1,1,1,0,1
19,15,07/13/2006,3,0,0,3,7,17,26,1019,1010,0,0,0,1,MS-CoNS,1,1,1,1,1,1,1,1,1,1,1,1,,1,0,0,1,2,1,1,Sched abb o for hours,0,0,0,0,0,0,0,0,0,0,0,0,0,,,,,1,15,,,,,,,,,0,0,0,0,0,0,0,0,0,0,0,0,0,0,0,0,0,1,1,0,0,1,1,1,1,1,0,1,1,1,0,1
77,15,08/09/2006,2,0,0,3,7,45,26,1019,1429,0,0,0,0,,1,1,1,1,1,1,1,1,1,1,1,1,,1,0,0,1,2,1,1,Sched abb o for hours,0,0,0,0,2,0,0,0,0,0,0,0,0,written q 8h instead of q 6h,,,,1,15,,,,,,,,,1,1,0,0,1,0,0,0,0,0,0,0,0,0,0,0,0,1,1,0,0,1,2,1,1,1,0,1,1,0,0,1
78,15,08/09/2006,2,0,0,3,1,45,26,1019,1429,0,0,0,0,,1,1,1,1,1,1,1,1,1,1,1,1,,1,0,0,1,2,1,1,Sched abb o for hours,0,0,0,0,2,0,0,0,0,0,0,0,0,written q 12h instead of q 8h,,,,1,15,,,,,,,,,1,1,0,0,1,0,0,0,0,0,0,0,0,0,0,0,0,1,1,0,0,1,2,1,1,1,0,1,1,0,0,1
79,15,08/09/2006,2,0,0,3,2,45,26,1019,1429,0,0,0,0,r/o NEC,1,1,1,1,1,1,1,1,1,1,1,1,,1,0,0,1,2,1,1,Sched abb o for hours,0,0,0,0,0,0,0,0,0,0,0,0,0,,,,,1,15,,,,,,,,,0,0,0,0,0,0,0,0,0,0,0,0,0,0,0,0,0,1,1,0,0,1,1,1,1,1,0,1,1,1,0,1
80,15,08/09/2006,2,0,0,3,3,45,26,1019,1429,0,0,0,0,r/o NEC,1,1,1,1,1,1,1,1,1,1,1,1,,1,0,0,1,2,1,1,Sched abb o for hours,0,0,1,0,0,0,0,0,0,0,0,0,0,wrong dose calculated then corrected on same order per PharmD,,,,1,15,,,,,,,,,1,1,1,0,0,0,0,0,0,0,0,0,0,0,0,0,0,1,1,0,0,1,2,1,1,1,0,1,0,1,0,1
18,6,07/12/2006,2,1,0,3,3,11,24,640,730,0,0,0,1,,1,1,1,1,1,1,1,1,1,1,1,1,,1,0,0,1,2,1,1,Sched abb o for hours,0,0,0,0,0,0,0,0,0,0,0,0,0,,,,,1,6,,,,,,,,,0,0,0,0,0,0,0,0,0,0,0,0,0,0,0,0,0,1,1,0,0,1,1,1,1,1,0,1,1,1,0,1
43,6,07/12/2006,2,1,0,3,7,11,24,640,730,0,0,0,0,,1,1,1,1,1,1,1,1,1,1,1,1,,1,0,0,1,1,1,1,,0,0,0,0,0,0,0,0,0,0,0,0,0,,,,,1,6,,,,,,,,,0,0,0,0,0,0,0,0,0,0,0,0,0,0,0,0,0,0,0,0,0,0,0,1,1,1,0,1,1,1,0,1
44,6,07/12/2006,2,1,0,3,1,11,24,640,730,0,0,0,0,,1,1,1,1,1,1,1,1,1,1,1,1,,1,1,0,1,1,1,1,,0,0,0,0,0,0,0,0,0,0,0,0,0,,,,,1,6,,,,,,,,,0,0,0,0,0,0,0,0,0,0,0,0,0,0,0,0,0,0,0,0,0,0,0,1,1,1,1,1,1,1,0,1
12,32,07/04/2006,1,1,2,1,8,5,37,3410,3400,0,0,0,0,rectal perforation,1,1,1,1,1,1,1,1,1,1,1,1,,0,1,0,1,2,1,1,decimal on Flagyl (25,0,0,0,0,0,0,0,1,0,0,0,0,0,not STAT but already on Amp/Gent,Pt name (incorrect),,Pager (no),1,32,,,,,,,,,0,0,0,0,0,0,0,0,0,0,0,0,0,0,0,0,0,1,3,0,0,1,3,1,1,1,1,1,1,1,1,0
13,32,07/04/2006,1,1,2,1,2,5,37,3410,3400,0,0,0,0,rectal perforation,1,1,1,1,1,1,1,1,1,1,1,1,,1,0,0,1,2,1,1,h for hours,0,0,0,0,0,0,0,1,0,0,0,0,0,not STAT but already on Amp/Gent,MRN (incorrect),,DOB/Age (no),1,32,,,,,,,,,0,0,0,0,0,0,0,0,0,0,0,0,0,0,0,0,0,1,2,0,0,1,2,1,1,1,0,1,1,1,1,1
17,32,07/10/2006,0,0,1,1,8,11,37,3410,3300,0,0,0,0,rectal perforation,1,1,1,1,1,1,1,1,1,3,1,1,mg/kg not noted as per day or per dose,1,0,0,1,2,1,1,Sched abb o for hours,0,0,0,0,0,0,0,0,0,0,0,0,0,,,,,1,32,,,,,,,,,0,0,0,0,0,0,0,0,0,0,0,0,0,0,0,0,0,1,1,1,1,1,2,1,1,0,0,1,1,1,1,0
25,31,07/14/2006,4,1,6,4,3,13,40,3335,3300,0,1,1,0,Femoral line; ECMO; pH 7.6,1,1,1,1,1,1,1,1,1,1,1,1,,1,0,0,1,2,1,1,Sched abb o for hours,0,0,0,0,0,0,0,0,0,0,0,0,0,,,,,1,31,,,,,,,,,0,0,0,0,0,0,0,0,0,0,0,0,0,0,0,0,0,1,1,0,0,1,1,1,1,1,0,1,1,1,1,1
26,31,07/14/2006,4,1,6,4,2,13,40,3335,3300,0,1,1,0,Femoral line; ECMO; pH 7.6,1,1,1,1,1,1,1,1,1,1,1,1,,1,0,0,1,2,1,1,Sched abb o for hours,0,0,0,0,0,0,0,0,0,0,0,0,0,,,,,1,31,,,,,,,,,0,0,0,0,0,0,0,0,0,0,0,0,0,0,0,0,0,1,1,0,0,1,1,1,1,1,0,1,1,1,1,1
16,25,07/03/2006,0,0,1,1,7,3,36,2045,2045,0,0,0,0,r/o cellulitis,1,1,1,1,1,1,1,1,1,3,1,1,mg/kg not noted as per day or per dose,1,0,0,1,2,1,1,Sched abb o for hours,0,0,0,0,0,0,0,1,0,0,0,0,0,,,,,1,25,,,,,,,,,0,0,0,0,0,0,0,0,0,0,0,0,0,0,0,0,0,1,2,1,1,1,3,1,1,0,0,1,1,1,1,1
9,14,07/09/2006,6,1,0,3,4,7,24,830,680,0,0,0,0,,1,1,1,1,1,1,1,1,1,1,1,0,missing pager #,1,0,0,1,2,1,1,Sched abb o for hours,1,1,0,0,0,0,0,1,0,0,0,0,0,,Contraind (yes),Date (incorrect),Frequen (no),1,14,,,,,,,,,0,0,0,0,0,0,0,0,0,0,0,0,0,0,0,0,0,1,2,1,1,1,3,1,1,1,0,1,1,1,0,1
10,14,07/09/2006,6,1,0,3,2,7,24,830,680,1,0,0,0,antecubital wounds,1,1,1,1,1,1,1,1,1,1,1,1,,1,0,0,1,2,1,1,Sched abb o for hours,0,0,1,0,0,0,0,0,0,0,0,0,0,"Dose not adjusted for renal failure (SCr 1.1 at time of order, pm level 1.0, 1.3 day prior)",OtherError (yes),Time (incorrect),Mg/Kg (no or,1,14,,,,,,,,,1,1,1,0,0,0,0,0,0,0,0,0,0,0,0,0,0,1,1,0,0,1,2,1,1,1,0,1,0,1,0,1
11,14,07/09/2006,6,1,0,3,1,7,24,830,680,1,0,0,0,,1,1,1,1,1,1,1,1,1,1,1,1,,1,0,0,1,2,1,1,Sched abb o for hours,0,0,1,0,0,0,0,0,0,0,0,0,0,"Dose not adjusted for renal failure (SCr 1.1 at time of order, pm level 1.0, 1.3 day prior)",Mg/kg (incorrect),,Signature (no,1,14,,,,,,,,,1,1,1,0,0,0,0,0,0,0,0,0,0,0,0,0,0,1,1,0,0,1,2,1,1,1,0,1,0,1,0,1
20,34,07/13/2006,3,0,0,3,2,8,37,3885,3130,0,0,0,0,dose change based on trough of 15.1,1,1,1,1,1,1,1,1,1,3,1,1,mg/kg not noted as per day or per dose,1,0,0,1,2,1,1,Sched abb o for hours,0,0,0,0,0,0,0,0,0,0,0,0,0,,,,,1,34,,,,,,,,,0,0,0,0,0,0,0,0,0,0,0,0,0,0,0,0,0,1,1,1,1,1,2,1,1,0,0,1,1,1,0,1
45,34,07/10/2006,0,1,0,3,2,5,37,3885,3280,0,0,0,0,? Brain abcess,1,1,1,1,1,1,1,1,1,1,1,1,,1,0,0,1,1,1,1,,0,0,0,0,0,0,0,1,0,0,0,0,0,,,,,1,34,,,,,,,,,0,0,0,0,0,0,0,0,0,0,0,0,0,0,0,0,0,1,1,0,0,1,1,1,1,1,0,1,1,1,0,1
46,34,07/10/2006,0,1,0,3,10,5,37,3885,3280,0,0,0,0,? Brain abcess,1,1,1,1,1,1,1,1,1,1,1,1,,1,0,0,1,1,1,1,,0,0,0,0,0,0,0,1,0,0,0,0,0,,,,,1,34,,,,,,,,,0,0,0,0,0,0,0,0,0,0,0,0,0,0,0,0,0,1,1,0,0,1,1,1,1,1,0,1,1,1,0,0
47,34,07/12/2006,2,1,0,3,5,7,37,3885,3130,0,0,0,0,? Brain abcess,1,1,2,1,1,1,1,1,1,1,1,1,order wt 3.3kg/our wt 3130g,1,0,0,1,1,1,1,,0,0,0,0,0,0,0,0,0,0,0,0,0,,,,,1,34,,,,,,,,,1,1,0,0,0,0,0,0,0,0,0,0,0,0,0,1,0,0,0,0,0,1,1,0,1,1,0,1,1,1,0,0
39,2,07/23/2006,6,1,0,3,2,11,23,510,505,1,0,0,1,,1,1,1,1,1,1,1,1,1,1,1,1,,1,0,0,1,1,1,1,,0,0,0,0,0,0,0,0,0,0,0,0,0,,,,,1,2,,,,,,,,,0,0,0,0,0,0,0,0,0,0,0,0,0,0,0,0,0,0,0,0,0,0,0,1,1,1,0,1,1,1,0,1
40,2,07/23/2006,6,1,0,3,4,11,23,510,505,1,0,0,0,,1,1,1,1,1,1,1,1,1,1,1,1,,0,0,0,1,2,1,1,Sched abb o for hours,0,0,0,0,0,0,0,1,0,0,0,0,0,looks like STAT only applies to vanco,,,,1,2,,,,,,,,,0,0,0,0,0,0,0,0,0,0,0,0,0,0,0,0,0,1,3,0,0,1,3,1,1,1,0,1,1,1,0,1
41,2,07/23/2006,6,1,0,3,1,11,23,510,505,1,0,0,1,gram (-) rod,1,1,1,1,1,1,1,1,1,1,1,1,,1,1,0,1,1,1,1,,0,0,0,0,0,0,0,0,0,0,0,0,0,,,,,1,2,,,,,,,,,0,0,0,0,0,0,0,0,0,0,0,0,0,0,0,0,0,0,0,0,0,0,0,1,1,1,1,1,1,1,0,1
52,2,07/22/2006,5,1,0,3,2,10,23,510,460,1,0,0,0,,1,1,1,1,1,1,1,1,1,1,1,1,,1,0,0,1,1,1,1,,0,0,0,0,0,0,0,0,0,0,0,0,0,SCr 2.5,,,,1,2,,,,,,,,,0,0,0,0,0,0,0,0,0,0,0,0,0,0,0,0,0,0,0,0,0,0,0,1,1,1,0,1,1,1,0,1
53,2,07/22/2006,5,1,0,3,3,10,23,510,460,1,0,0,0,,1,1,1,1,1,1,1,1,1,3,1,1,,1,1,0,1,2,1,1,Sched abb o for hours,0,0,0,0,0,0,0,0,0,0,0,0,0,SCr 2.5,,,,1,2,,,,,,,,,0,0,0,0,0,0,0,0,0,0,0,0,0,0,0,0,0,1,1,1,1,1,2,1,1,0,1,1,1,1,0,1
33,18,07/27/2006,3,0,2,1,7,11,32,1190,1155,0,0,0,0,,1,1,2,1,1,2,1,1,1,1,1,1,birthweight used; name of drug misspel,1,1,0,1,1,1,1,,0,0,1,0,1,0,0,0,0,0,0,0,0,"75 mg/kg/day with max of 50 mg/kg/day; q8hr, should be q 12 hour since <1200 g",,,,1,18,,,,,,,,,1,3,1,0,1,0,0,0,0,0,0,0,0,0,0,1,0,1,1,0,0,1,4,0,1,1,1,1,0,0,1,1
34,18,07/27/2006,3,0,2,1,1,11,32,1190,1155,0,0,0,0,,1,1,2,1,1,1,1,1,1,1,1,1,birthweight used,1,1,0,1,1,1,1,,0,0,0,0,0,0,0,0,0,0,0,0,0,,,,,1,18,,,,,,,,,1,1,0,0,0,0,0,0,0,0,0,0,0,0,0,1,0,0,0,0,0,1,1,0,1,1,1,1,1,1,1,1
48,16,07/28/2006,4,0,1,1,7,11,29,1035,1300,0,0,0,0,,1,1,1,1,1,1,1,1,1,3,1,1,mg/kg not noted as per day or per dose,1,0,0,1,2,1,1,Sched abb o for hours,0,0,0,0,0,0,0,0,0,0,0,0,0,,,,,1,16,,,,,,,,,0,0,0,0,0,0,0,0,0,0,0,0,0,0,0,0,0,1,1,1,1,1,2,1,1,0,0,1,1,1,1,1
49,16,07/28/2006,4,0,1,1,1,11,29,1035,1300,0,0,0,0,,1,1,1,1,1,1,1,1,1,3,1,1,mg/kg not noted as per day or per dose,1,0,2,1,2,1,1,Sched abb o for hours,0,0,0,0,0,0,0,0,0,0,0,0,0,,,,,1,16,,,,,,,,,0,0,0,0,0,0,0,0,0,0,0,0,0,0,0,0,0,1,2,1,1,1,3,1,1,0,0,1,1,1,1,1
83,16,08/13/2006,6,1,2,1,7,27,29,1035,1677,0,0,0,0,,1,1,1,1,1,1,1,1,1,1,1,1,,0,1,0,1,1,1,1,42.5mg Nafcillin,0,0,0,0,0,0,0,1,0,0,0,0,0,,,,,1,16,,,,,,,,,0,0,0,0,0,0,0,0,0,0,0,0,0,0,0,0,0,1,2,0,0,1,2,1,1,1,1,1,1,1,1,1
84,16,08/13/2006,6,1,2,1,1,27,29,1035,1677,0,0,0,0,,1,1,1,1,1,1,1,1,1,1,1,1,,1,1,0,1,1,1,1,,0,0,0,0,2,0,0,1,0,0,0,0,0,q24 instead of q12h,,,,1,16,,,,,,,,,1,1,0,0,1,0,0,0,0,0,0,0,0,0,0,0,0,1,1,0,0,1,2,1,1,1,1,1,1,0,1,1
50,5,07/27/2006,3,1,0,3,7,9,25,620,600,1,0,0,0,,1,1,1,1,1,1,1,1,1,1,1,1,,1,0,0,1,2,1,1,Sched abb o for hours,0,0,0,0,0,0,0,0,0,0,0,0,0,,,,,1,5,,,,,,,,,0,0,0,0,0,0,0,0,0,0,0,0,0,0,0,0,0,1,1,0,0,1,1,1,1,1,0,1,1,1,0,1
51,5,07/27/2006,3,1,0,3,1,9,25,620,600,1,0,0,0,,1,1,1,1,1,1,1,1,1,1,1,1,,1,1,0,1,2,1,1,Sched abb o for hours,0,0,2,0,0,0,0,0,0,0,0,0,0,SCr 1.3,,,,1,5,,,,,,,,,1,1,1,0,0,0,0,0,0,0,0,0,0,0,0,0,0,1,1,0,0,1,2,1,1,1,1,1,0,1,0,1
87,5,08/15/2006,1,0,2,1,2,28,25,620,610,1,0,1,0,,1,1,1,1,1,1,1,1,1,1,1,1,,1,0,0,1,1,1,1,,0,0,0,0,0,0,0,0,0,0,0,0,0,STAT is in different handwritting,,,,1,5,,,,,,,,,0,0,0,0,0,0,0,0,0,0,0,0,0,0,0,0,0,0,0,0,0,0,0,1,1,1,0,1,1,1,1,1
88,5,08/15/2006,1,0,2,1,3,28,25,620,610,1,0,1,0,,1,1,1,1,1,1,1,1,1,1,1,1,,1,0,0,1,1,1,1,,1,1,0,0,0,0,0,1,0,0,0,0,0,STAT is in different handwritting,,,,1,5,,,,,,,,,0,0,0,0,0,0,0,0,0,0,0,0,0,0,0,0,0,1,1,0,0,1,1,1,1,1,0,1,1,1,1,1
89,5,08/15/2006,1,0,2,1,6,28,25,620,610,1,0,1,0,,1,1,1,2,1,1,1,1,1,1,1,1,,1,0,0,1,1,1,1,,0,0,0,0,0,0,0,1,0,0,0,0,0,STAT is in different handwritting,,,,1,5,,,,,,,,,0,0,0,0,0,0,0,0,0,0,0,0,0,0,0,0,0,1,2,0,0,1,2,1,0,1,0,1,1,1,1,0
31,14,07/27/2006,3,0,0,3,0,7,27,980,900,0,0,0,0,suspected pneumonia,1,1,1,1,1,1,1,1,1,1,1,1,pager# difficult to read,1,0,0,1,2,0,1,could not read pager,0,0,0,0,0,0,1,0,0,0,0,0,0,Amp chosen for neonate >72hr,,,,1,14,,,,,,,,,1,1,0,0,0,0,0,1,0,0,0,0,0,0,0,0,0,1,2,0,0,1,3,1,1,1,0,1,1,1,0,1
32,14,07/27/2006,3,0,0,3,1,7,27,980,900,0,0,0,0,suspected pneumonia,1,1,1,1,1,1,1,1,1,1,1,1,pager# difficult to read,1,1,0,1,2,0,1,could not read pager,0,0,0,0,0,0,1,0,0,0,0,0,0,gent inappropriate for pneumonia DOL 7,,,,1,14,,,,,,,,,1,1,0,0,0,0,0,1,0,0,0,0,0,0,0,0,0,1,2,0,0,1,3,1,1,1,1,1,1,1,0,1
59,14,08/04/2006,4,0,0,3,2,15,27,980,960,0,1,0,0,,1,1,1,1,1,1,1,1,1,1,1,1,,1,0,0,1,1,1,1,,0,0,0,0,0,0,0,0,0,0,0,0,0,,,,,1,14,,,,,,,,,0,0,0,0,0,0,0,0,0,0,0,0,0,0,0,0,0,0,0,0,0,0,0,1,1,1,0,1,1,1,0,1
60,14,08/04/2006,4,0,0,3,3,15,27,980,960,0,1,0,0,,1,1,1,1,1,1,1,1,1,1,1,1,,1,0,0,1,1,1,1,,0,0,0,0,0,0,0,0,0,0,0,0,0,,,,,1,14,,,,,,,,,0,0,0,0,0,0,0,0,0,0,0,0,0,0,0,0,0,0,0,0,0,0,0,1,1,1,0,1,1,1,0,1
135,14,08/28/2006,0,0,0,3,7,39,27,980,1510,0,0,0,0,,1,1,1,1,1,1,1,1,1,3,1,0,"mg/kg/d (d?), missing pager #",1,0,0,1,2,1,1,Sched abb o for hours,1,2,0,0,2,0,0,0,0,0,0,0,0,omitted pager #; q8h instead of q 6h,,,,1,14,,,,,,,,,1,1,0,0,1,0,0,0,0,0,0,0,0,0,0,0,0,1,1,1,2,1,4,1,1,0,0,1,1,0,0,1
136,14,08/28/2006,0,0,0,3,1,39,27,980,1510,0,0,0,0,asp pneumonia,1,1,1,1,1,1,1,1,1,3,1,0,"mg/kg/d (d?), missing pager #",1,1,0,1,2,1,1,Sched abb o for hours,1,2,0,0,2,0,0,0,0,0,0,0,0,"omitted pager #, q 12 should be q 8",,,,1,14,,,,,,,,,1,1,0,0,1,0,0,0,0,0,0,0,0,0,0,0,0,1,1,1,2,1,4,1,1,0,1,1,1,0,0,1
70,23,08/10/2006,3,0,2,1,2,1,30,1485,1480,0,0,1,0,CT insertion not sterile,1,1,1,1,1,1,1,1,1,1,1,1,,1,0,0,1,1,1,1,,0,0,1,0,0,0,0,0,0,0,0,0,0,should be 15 mg/kg (>1200g),,,,1,23,,,,,,,,,1,1,1,0,0,0,0,0,0,0,0,0,0,0,0,0,0,0,0,0,0,1,1,1,1,1,0,1,0,1,1,1
104,23,08/22/2006,1,0,2,1,4,13,30,1485,1600,0,0,0,0,,1,1,1,1,1,1,1,1,1,1,1,1,2 residents signed with pager numbers,0,1,0,1,1,1,1,19.2 mg fluconazole,0,0,0,0,0,0,0,1,0,0,0,0,1,2 residents signed order with 2 pager #'s,,,,1,23,,,,,,,,,1,1,0,0,0,0,0,0,0,0,0,1,0,0,0,0,0,1,2,0,0,1,3,1,1,1,1,1,1,1,1,1
105,23,08/22/2006,1,0,2,1,2,13,30,1485,1600,0,0,0,0,,1,1,1,1,1,1,1,1,1,1,1,1,2 residents signed with pager numbers,1,0,0,1,1,1,1,,0,0,0,0,0,0,0,1,0,0,0,0,1,2 residents signed order with 2 pager #'s,,,,1,23,,,,,,,,,1,1,0,0,0,0,0,0,0,0,0,1,0,0,0,0,0,1,1,0,0,1,2,1,1,1,0,1,1,1,1,1
106,23,08/22/2006,1,0,2,1,3,13,30,1485,1600,0,0,0,0,,1,1,1,1,1,1,1,1,1,1,1,1,2 residents signed with pager numbers,1,0,0,1,1,1,1,,0,0,0,0,0,0,0,1,0,0,0,0,1,2 residents signed order with 2 pager #'s,,,,1,23,,,,,,,,,1,1,0,0,0,0,0,0,0,0,0,1,0,0,0,0,0,1,1,0,0,1,2,1,1,1,0,1,1,1,1,1
124,23,09/01/2006,4,0,2,1,2,23,30,1485,2125,0,1,0,0,,1,1,1,1,1,1,1,1,1,1,1,1,,1,0,0,1,1,1,1,,0,0,0,0,0,0,0,0,0,0,0,0,0,,,,,1,23,,,,,,,,,0,0,0,0,0,0,0,0,0,0,0,0,0,0,0,0,0,0,0,0,0,0,0,1,1,1,0,1,1,1,1,1
125,23,09/01/2006,4,0,2,1,4,23,30,1485,2125,0,1,0,0,,1,1,1,1,1,1,1,1,1,1,1,1,,1,0,0,1,1,1,1,,0,0,0,0,0,0,0,0,0,0,0,0,0,,,,,1,23,,,,,,,,,0,0,0,0,0,0,0,0,0,0,0,0,0,0,0,0,0,0,0,0,0,0,0,1,1,1,0,1,1,1,1,1
126,23,09/01/2006,4,0,2,1,3,23,30,1485,2125,0,1,0,0,,1,1,1,1,1,1,1,1,1,1,1,1,,1,0,0,1,1,1,1,,0,0,0,0,0,0,0,0,0,0,0,0,0,,,,,1,23,,,,,,,,,0,0,0,0,0,0,0,0,0,0,0,0,0,0,0,0,0,0,0,0,0,0,0,1,1,1,0,1,1,1,1,1
128,23,08/24/2006,3,0,2,1,2,15,30,1485,1600,0,1,1,1,,1,1,1,1,1,1,1,1,1,1,1,1,,1,0,0,1,1,1,1,,0,0,0,0,0,0,0,0,0,0,0,0,0,,,,,1,23,,,,,,,,,0,0,0,0,0,0,0,0,0,0,0,0,0,0,0,0,0,0,0,0,0,0,0,1,1,1,0,1,1,1,1,1
42,24,07/28/2006,4,0,0,3,5,6,32,1535,1500,0,0,0,0,,1,1,1,1,1,1,1,1,1,1,1,1,,1,0,0,1,2,1,1,Sched abb o for hours,0,0,0,1,2,0,0,0,0,0,0,0,0,10 mg/kg/day should be 20 mg/kg day; q24h should be q12h,,,,1,24,,,,,,,,,1,2,0,1,1,0,0,0,0,0,0,0,0,0,0,0,0,1,1,0,0,1,3,1,1,1,0,1,1,0,0,0
54,24,07/28/2006,4,0,0,3,3,6,32,1535,1359,0,0,0,1,Resist e.coli,1,1,1,1,1,1,1,1,1,1,1,0,missing pager #,1,0,0,1,2,1,1,Sched abb o for hours,1,1,0,0,0,0,0,0,0,0,0,0,0,no pager #,,,,1,24,,,,,,,,,0,0,0,0,0,0,0,0,0,0,0,0,0,0,0,0,0,1,1,1,1,1,2,1,1,1,0,1,1,1,0,1
55,24,07/28/2006,4,0,0,3,5,6,32,1535,1359,0,0,0,0,,1,1,1,1,1,1,1,1,1,1,1,0,missing pager #,1,0,0,1,2,1,1,Sched abb o for hours,1,1,0,0,0,0,0,0,0,0,0,0,0,no pager #,,,,1,24,,,,,,,,,0,0,0,0,0,0,0,0,0,0,0,0,0,0,0,0,0,1,1,1,1,1,2,1,1,1,0,1,1,1,0,0
61,7,08/04/2006,4,0,2,1,2,12,25,650,780,0,0,0,1,gram (+) cocci in PICC,1,1,1,1,1,1,1,1,1,1,1,1,,1,0,0,1,2,1,1,Sched abb o for hours,0,0,0,0,0,0,0,1,0,0,0,0,0,change from nafcillin to vanc should be STAT,,,,1,7,,,,,,,,,0,0,0,0,0,0,0,0,0,0,0,0,0,0,0,0,0,1,2,0,0,1,2,1,1,1,0,1,1,1,1,1
62,7,08/04/2006,4,0,2,1,3,12,25,650,780,0,0,0,0,gram (+) cocci in PICC,1,1,1,1,1,1,1,1,1,3,1,1,mg/kg not noted as per day or per dose,1,0,0,1,2,1,1,Sched abb o for hours,0,0,0,0,0,0,1,0,0,0,0,0,0,no reason for Zosyn noted in chart,,,,1,7,,,,,,,,,1,1,0,0,0,0,0,1,0,0,0,0,0,0,0,0,0,1,1,1,1,1,3,1,1,0,0,1,1,1,1,1
63,7,08/07/2006,0,0,0,3,2,15,25,650,810,0,0,0,0,,1,1,1,1,1,1,1,1,1,1,1,1,,1,0,0,1,1,1,1,,0,0,0,0,0,0,0,0,0,0,0,0,0,,,,,1,7,,,,,,,,,0,0,0,0,0,0,0,0,0,0,0,0,0,0,0,0,0,0,0,0,0,0,0,1,1,1,0,1,1,1,0,1