caseid,ydid,dxyr,acosfinal,er,pr,palmetto,ydod,dodyr,age,race,county,site,lat,morph,beh,seq,grade,seer_stage,tnm_path_stage,tumor_size,brcadth04,vital04,ercat,prcat,seqcat,gradecat,seercat,erprcat,erprcat2,vscat,survyr,age5cat,ER_Grade,age5cat2,eapopagecat,aapopagecat,i_EA,i_AA,incidence,GradeERcat,black,lymphcat,ajcc,ajcccat,agecat,incidwt,examined_nodes,positive_nodes,nodecat,nodexam,nodebest,stagen,graden,ern
00000097_03,2004,2004,1,9,9,0,,,91,White,21,C508,2,8500,3,3,9,9,99,999,,1,dk,dk,8,9,Dk,99,9,0,,90,ERdkGdk,85,28020,9020,0.0000357,0.0001109,0.0000357,GdkERdk,0,9,dk,9,3,0.2802,0,98,9,0,9,,,
00001778_02,2004,2004,0,,,0,,,71,White,12,C509,1,8500,3,2,2,1,1,999,,1,dk,dk,8,2,Localized,99,9,0,,70,ERdkG2,70,53970,16130,0.0000185,0.000062,0.0000185,G2ERdk,0,0,I,1,3,0.5397,2,0,0,1,0,1,2,
00002084_02,2004,2004,1,1,2,1,,,48,Black,43,C504,1,8500,3,2,2,1,1,19,,1,pos,neg,8,2,Localized,12,3,0,,45,ERposG2,45,101560,45180,9.85E-06,0.0000221,0.0000221,G2ERpos,1,0,I,1,1,0.4518,28,0,0,1,0,1,2,1
00002235_02,2004,2004,1,2,2,1,,,69,White,43,C505,2,8500,3,2,3,3,2B,22,,1,neg,neg,8,3,Regional,22,2,0,,65,ERnegG3,65,59990,18130,0.0000167,0.0000552,0.0000167,G3ERneg,0,1,IIB,2,3,0.5999,19,1,1,1,1,3,3,0
00002453_02,2004,2004,1,8,8,0,,,91,White,44,C508,1,8480,3,2,1,1,2A,40,,1,dk,dk,8,1,Localized,99,9,0,,90,ERdkG1,85,28020,9020,0.0000357,0.0001109,0.0000357,G1ERdk,0,0,IIA,2,3,0.2802,2,0,0,1,0,1,1,
00002573_03,2004,2004,1,2,2,1,,,72,White,36,C501,2,8500,3,3,3,1,2A,42,,1,neg,neg,8,3,Localized,22,2,0,,70,ERnegG3,70,53970,16130,0.0000185,0.000062,0.0000185,G3ERneg,0,0,IIA,2,3,0.5397,6,0,0,1,0,1,3,0
00003599_02,2004,2004,0,,,0,,,74,White,26,C508,2,8523,3,2,9,1,88,10,,1,dk,dk,8,9,Localized,99,9,0,,70,ERdkGdk,70,53970,16130,0.0000185,0.000062,0.0000185,GdkERdk,0,0,NotApp,9,3,0.5397,4,0,0,1,0,1,,
00005265_02,2004,2004,1,1,1,1,,,72,Black,40,C504,2,8503,3,2,2,1,1,37,,1,pos,pos,8,2,Localized,11,1,0,,70,ERposG2,70,53970,16130,0.0000185,0.000062,0.000062,G2ERpos,1,0,I,1,3,0.1613,0,98,9,0,9,1,2,1
00005265_03,2004,2004,1,1,2,1,,,72,Black,40,C505,1,8520,3,3,1,1,1,10,,1,pos,neg,8,1,Localized,12,3,0,,70,ERposG1,70,53970,16130,0.0000185,0.000062,0.000062,G1ERpos,1,0,I,1,3,0.1613,4,0,0,1,0,1,1,1
00008310_02,2004,2004,1,1,2,0,,,55,Black,23,C508,2,8500,3,2,3,1,1,999,,1,pos,neg,8,3,Localized,12,3,0,,55,ERposG3,55,80490,25690,0.0000124,0.0000389,0.0000389,G3ERpos,1,0,I,1,2,0.2569,1,0,0,1,0,1,3,1
00010457_02,2004,2004,1,8,8,0,,,74,White,23,C508,1,8500,3,2,2,1,1,15,,1,dk,dk,8,2,Localized,99,9,0,,70,ERdkG2,70,53970,16130,0.0000185,0.000062,0.0000185,G2ERdk,0,0,I,1,3,0.5397,0,98,9,0,9,1,2,
00011876_02,2004,2004,1,9,9,0,,,76,White,23,C504,2,8522,3,2,3,1,1,20,,1,dk,dk,8,3,Localized,99,9,0,,75,ERdkG3,75,47680,13150,0.000021,0.000076,0.000021,G3ERdk,0,0,I,1,3,0.4768,14,0,0,1,0,1,3,
00016051_02,2004,2004,0,,,0,,,86,White,19,C508,2,8500,3,2,2,1,1,999,,1,dk,dk,8,2,Localized,99,9,0,,85,ERdkG2,85,28020,9020,0.0000357,0.0001109,0.0000357,G2ERdk,0,0,I,1,3,0.2802,8,0,0,1,0,1,2,
00017636_02,2004,2004,0,,,0,,,75,White,42,C509,2,8500,3,2,9,1,99,999,,1,dk,dk,8,9,Localized,99,9,0,,75,ERdkGdk,75,47680,13150,0.000021,0.000076,0.000021,GdkERdk,0,0,dk,9,3,0.4768,98,0,0,1,0,1,,
00017655_02,2004,2004,1,1,1,0,,,52,White,42,C508,2,8500,3,2,3,1,2A,22,,1,pos,pos,8,3,Localized,11,1,0,,50,ERposG3,50,97630,36030,0.0000102,0.0000278,0.0000102,G3ERpos,0,0,IIA,2,2,0.9763,0,98,9,0,9,1,3,1
00018437_02,2004,2004,1,1,2,1,,,59,White,32,C509,2,8500,3,2,2,3,2A,12,,1,pos,neg,8,2,Regional,12,3,0,,55,ERposG2,55,80490,25690,0.0000124,0.0000389,0.0000124,G2ERpos,0,1,IIA,2,2,0.8049001,11,1,1,1,1,3,2,1
00019105_02,2004,2004,1,2,2,1,,,42,Black,40,C508,1,8500,3,2,3,1,2A,26,,1,neg,neg,8,3,Localized,22,2,0,,40,ERnegG3,40,107200,49810,9.33E-06,0.0000201,0.0000201,G3ERneg,1,0,IIA,2,1,0.4981,4,0,0,1,0,1,3,0
00025033_03,2004,2004,1,1,1,0,,,66,White,23,C509,2,8500,3,3,3,1,1,8,,1,pos,pos,8,3,Localized,11,1,0,,65,ERposG3,65,59990,18130,0.0000167,0.0000552,0.0000167,G3ERpos,0,0,I,1,3,0.5999,3,0,0,1,0,1,3,1
00025336_02,2004,2004,0,,,0,,,83,White,43,C509,1,8500,3,2,1,1,88,12,,1,dk,dk,8,1,Localized,99,9,0,,80,ERdkG1,80,31730,9310,0.0000315,0.0001074,0.0000315,G1ERdk,0,0,NotApp,9,3,0.3173,0,98,9,0,9,1,1,
00026009_03,2004,2004,1,2,2,0,,,85,White,24,C504,1,8500,3,3,2,1,1,10,,1,neg,neg,8,2,Localized,22,2,0,,85,ERnegG2,85,28020,9020,0.0000357,0.0001109,0.0000357,G2ERneg,0,0,I,1,3,0.2802,5,0,0,1,0,1,2,0
00026604_02,2004,2004,1,2,2,0,,,56,White,23,C504,2,8500,3,2,3,1,2A,21,,1,neg,neg,8,3,Localized,22,2,0,,55,ERnegG3,55,80490,25690,0.0000124,0.0000389,0.0000124,G3ERneg,0,0,IIA,2,2,0.8049001,18,0,0,1,0,1,3,0
00026722_02,2004,2004,1,9,9,0,,,95,White,39,C509,2,8523,3,2,2,1,1,999,,1,dk,dk,8,2,Localized,99,9,0,,95,ERdkG2,85,28020,9020,0.0000357,0.0001109,0.0000357,G2ERdk,0,0,I,1,3,0.2802,0,98,9,0,9,1,2,
00027702_02,2004,2004,1,9,9,0,,,64,White,23,C502,1,8500,3,2,1,1,1,8,,1,dk,dk,8,1,Localized,99,9,0,,60,ERdkG1,60,66320,20670,0.0000151,0.0000484,0.0000151,G1ERdk,0,0,I,1,2,0.6632,16,0,0,1,0,1,1,
00028419_02,2004,2004,0,,,0,,,52,Black,39,C509,1,8480,3,2,9,1,99,,,1,dk,dk,8,9,Localized,99,9,0,,50,ERdkGdk,50,97630,36030,0.0000102,0.0000278,0.0000278,GdkERdk,1,0,dk,9,2,0.3603,0,98,9,0,9,1,,
00029617_02,2004,2004,1,2,2,0,,,52,White,15,C502,9,8500,3,2,3,1,1,14,,1,neg,neg,8,3,Localized,22,2,0,,50,ERnegG3,50,97630,36030,0.0000102,0.0000278,0.0000102,G3ERneg,0,0,I,1,2,0.9763,27,0,0,1,0,1,3,0
00031233_02,2004,2004,1,2,2,1,,,47,Black,38,C504,2,8500,3,2,3,3,3A,8,,1,neg,neg,8,3,Regional,22,2,0,,45,ERnegG3,45,101560,45180,9.85E-06,0.0000221,0.0000221,G3ERneg,1,1,IIIA,3,1,0.4518,22,9,1,1,1,3,3,0
00031280_02,2004,2004,1,2,2,0,,,71,White,38,C509,2,8500,3,2,3,3,2A,999,,1,neg,neg,8,3,Regional,22,2,0,,70,ERnegG3,70,53970,16130,0.0000185,0.000062,0.0000185,G3ERneg,0,1,IIA,2,3,0.5397,2,1,1,1,1,3,3,0
00033600_02,2004,2004,0,,,0,,,77,White,2,C504,1,8523,3,2,1,1,1,999,,1,dk,dk,8,1,Localized,99,9,0,,75,ERdkG1,75,47680,13150,0.000021,0.000076,0.000021,G1ERdk,0,0,I,1,3,0.4768,1,0,0,1,0,1,1,
00035537_03,2004,2004,1,9,9,0,,,71,White,35,C504,1,8500,3,3,2,1,1,999,,1,dk,dk,8,2,Localized,99,9,0,,70,ERdkG2,70,53970,16130,0.0000185,0.000062,0.0000185,G2ERdk,0,0,I,1,3,0.5397,4,0,0,1,0,1,2,
00035688_02,2004,2004,1,1,1,0,,,72,White,42,C508,1,8500,3,2,1,1,1,4,,1,pos,pos,8,1,Localized,11,1,0,,70,ERposG1,70,53970,16130,0.0000185,0.000062,0.0000185,G1ERpos,0,0,I,1,3,0.5397,0,98,9,0,9,1,1,1
00040310_02,2004,2004,1,2,2,1,,,66,White,2,C508,2,8500,3,2,3,3,2B,25,,1,neg,neg,8,3,Regional,22,2,0,,65,ERnegG3,65,59990,18130,0.0000167,0.0000552,0.0000167,G3ERneg,0,1,IIB,2,3,0.5999,13,2,1,1,1,3,3,0
00040312_02,2004,2004,1,1,1,1,,,64,White,40,C508,2,8500,3,2,2,1,1,12,,1,pos,pos,8,2,Localized,11,1,0,,60,ERposG2,60,66320,20670,0.0000151,0.0000484,0.0000151,G2ERpos,0,0,I,1,2,0.6632,0,98,9,0,9,1,2,1
00041041_04,2004,2004,1,9,9,0,,,79,White,10,C503,1,8480,3,4,3,1,1,12,,1,dk,dk,8,3,Localized,99,9,0,,75,ERdkG3,75,47680,13150,0.000021,0.000076,0.000021,G3ERdk,0,0,I,1,3,0.4768,1,0,0,1,0,1,3,
00041399_02,2004,2004,1,9,9,0,,,85,White,10,C504,1,8575,3,2,3,1,1,11,,1,dk,dk,8,3,Localized,99,9,0,,85,ERdkG3,85,28020,9020,0.0000357,0.0001109,0.0000357,G3ERdk,0,0,I,1,3,0.2802,0,98,9,0,9,1,3,
00042017_02,2004,2004,1,1,2,0,,,56,Black,42,C509,1,8500,3,2,2,3,99,5,,1,pos,neg,8,2,Regional,12,3,0,,55,ERposG2,55,80490,25690,0.0000124,0.0000389,0.0000389,G2ERpos,1,1,dk,9,2,0.2569,0,98,9,0,1,3,2,1
00043709_03,2004,2004,0,,,0,,,74,White,43,C509,1,8500,3,3,3,1,88,4,,1,dk,dk,8,3,Localized,99,9,0,,70,ERdkG3,70,53970,16130,0.0000185,0.000062,0.0000185,G3ERdk,0,0,NotApp,9,3,0.5397,98,0,0,1,0,1,3,
00044285_03,2004,2004,1,1,1,0,,,74,Black,33,C504,2,8520,3,3,1,1,1,999,,1,pos,pos,8,1,Localized,11,1,0,,70,ERposG1,70,53970,16130,0.0000185,0.000062,0.000062,G1ERpos,1,0,I,1,3,0.1613,12,0,0,1,0,1,1,1
00044596_02,2004,2004,1,2,2,0,,,57,White,24,C501,1,8500,3,2,1,1,1,3,,1,neg,neg,8,1,Localized,22,2,0,,55,ERnegG1,55,80490,25690,0.0000124,0.0000389,0.0000124,G1ERneg,0,0,I,1,2,0.8049001,8,0,0,1,0,1,1,0
00045654_02,2004,2004,1,1,1,0,,,71,Black,23,C508,1,8523,3,2,1,1,99,33,,1,pos,pos,8,1,Localized,11,1,0,,70,ERposG1,70,53970,16130,0.0000185,0.000062,0.000062,G1ERpos,1,0,dk,9,3,0.1613,98,0,0,1,0,1,1,1
00045965_02,2004,2004,1,9,9,0,,,83,White,23,C509,1,8500,3,2,2,1,1,11,,1,dk,dk,8,2,Localized,99,9,0,,80,ERdkG2,80,31730,9310,0.0000315,0.0001074,0.0000315,G2ERdk,0,0,I,1,3,0.3173,1,0,0,1,0,1,2,
00046847_02,2004,2004,1,1,1,0,,,68,White,4,C508,2,8500,3,2,1,1,1,13,,1,pos,pos,8,1,Localized,11,1,0,,65,ERposG1,65,59990,18130,0.0000167,0.0000552,0.0000167,G1ERpos,0,0,I,1,3,0.5999,97,0,0,1,0,1,1,1
00047604_02,2004,2004,1,1,1,0,,,67,White,10,C504,2,8520,3,2,3,3,2A,20,,1,pos,pos,8,3,Regional,11,1,0,,65,ERposG3,65,59990,18130,0.0000167,0.0000552,0.0000167,G3ERpos,0,1,IIA,2,3,0.5999,2,1,1,1,1,3,3,1
00053246_02,2004,2004,0,,,0,,,79,White,42,C504,2,8500,3,2,2,3,2B,22,,1,dk,dk,8,2,Regional,99,9,0,,75,ERdkG2,75,47680,13150,0.000021,0.000076,0.000021,G2ERdk,0,1,IIB,2,3,0.4768,6,1,1,1,1,3,2,
00053841_02,2004,2004,0,,,0,2004,2004,91,Black,28,C509,9,8000,3,2,9,9,99,999,0,0,dk,dk,8,9,Dk,99,9,2,0,90,ERdkGdk,85,28020,9020,0.0000357,0.0001109,0.0001109,GdkERdk,1,9,dk,9,3,0.0902,99,99,9,9,9,,,
00055070_02,2004,2004,1,2,1,1,,,65,White,40,C509,2,8500,3,2,2,3,2B,999,,1,neg,pos,8,2,Regional,21,3,0,,65,ERnegG2,65,59990,18130,0.0000167,0.0000552,0.0000167,G2ERneg,0,1,IIB,2,3,0.5999,5,1,1,1,1,3,2,0
00056751_02,2004,2004,0,,,0,,,81,White,40,C501,2,8401,3,2,3,7,99,65,,1,dk,dk,8,3,Distant,99,9,0,,80,ERdkG3,80,31730,9310,0.0000315,0.0001074,0.0000315,G3ERdk,0,9,dk,9,3,0.3173,2,2,1,1,1,7,3,
00057199_02,2004,2004,1,9,9,0,,,77,White,17,C505,2,8500,3,2,9,3,2B,999,,1,dk,dk,8,9,Regional,99,9,0,,75,ERdkGdk,75,47680,13150,0.000021,0.000076,0.000021,GdkERdk,0,1,IIB,2,3,0.4768,11,3,1,1,1,3,,
00058315_03,2004,2004,0,,,0,,,77,White,6,C509,1,8500,3,3,1,1,1,6,,1,dk,dk,8,1,Localized,99,9,0,,75,ERdkG1,75,47680,13150,0.000021,0.000076,0.000021,G1ERdk,0,0,I,1,3,0.4768,18,0,0,1,0,1,1,
00058537_04,2004,2004,1,0,0,1,,,60,Black,38,C509,2,8520,3,4,1,1,99,30,,1,dk,dk,8,1,Localized,99,9,0,,60,ERdkG1,60,66320,20670,0.0000151,0.0000484,0.0000484,G1ERdk,1,0,dk,9,2,0.2067,0,98,9,0,9,1,1,
00059532_02,2004,2004,1,1,1,0,,,81,White,38,C508,1,8500,3,2,3,1,1,12,,1,pos,pos,8,3,Localized,11,1,0,,80,ERposG3,80,31730,9310,0.0000315,0.0001074,0.0000315,G3ERpos,0,0,I,1,3,0.3173,18,0,0,1,0,1,3,1
00061272_02,2004,2004,1,1,1,0,,,63,White,23,C504,1,8500,3,2,2,1,99,4,,1,pos,pos,8,2,Localized,11,1,0,,60,ERposG2,60,66320,20670,0.0000151,0.0000484,0.0000151,G2ERpos,0,0,dk,9,2,0.6632,0,98,9,0,9,1,2,1
00061536_02,2004,2004,1,9,9,0,,,73,White,23,C508,2,8480,3,2,1,1,1,7,,1,dk,dk,8,1,Localized,99,9,0,,70,ERdkG1,70,53970,16130,0.0000185,0.000062,0.0000185,G1ERdk,0,0,I,1,3,0.5397,2,0,0,1,0,1,1,
00063024_02,2004,2004,0,,,0,,,64,White,11,C509,1,8522,3,2,3,2,99,,,1,dk,dk,8,3,Regional,99,9,0,,60,ERdkG3,60,66320,20670,0.0000151,0.0000484,0.0000151,G3ERdk,0,9,dk,9,2,0.6632,0,98,9,0,9,2,3,
00064929_02,2004,2004,1,1,1,0,,,66,White,4,C504,2,8500,3,2,2,1,1,12,,1,pos,pos,8,2,Localized,11,1,0,,65,ERposG2,65,59990,18130,0.0000167,0.0000552,0.0000167,G2ERpos,0,0,I,1,3,0.5999,11,0,0,1,0,1,2,1
00065132_02,2004,2004,1,1,1,0,,,51,White,4,C508,2,8500,3,2,1,1,1,5,,1,pos,pos,8,1,Localized,11,1,0,,50,ERposG1,50,97630,36030,0.0000102,0.0000278,0.0000102,G1ERpos,0,0,I,1,2,0.9763,4,0,0,1,0,1,1,1
00067484_03,2004,2004,1,1,1,0,,,75,White,38,C505,2,8522,3,3,3,3,2A,15,,1,pos,pos,8,3,Regional,11,1,0,,75,ERposG3,75,47680,13150,0.000021,0.000076,0.000021,G3ERpos,0,1,IIA,2,3,0.4768,12,1,1,1,1,3,3,1
00067536_02,2004,2004,1,1,1,0,,,76,Black,38,C508,1,8480,3,2,2,1,1,16,,1,pos,pos,8,2,Localized,11,1,0,,75,ERposG2,75,47680,13150,0.000021,0.000076,0.000076,G2ERpos,1,0,I,1,3,0.1315,0,98,9,0,9,1,2,1
00067687_03,2004,2004,1,1,1,0,,,70,Black,5,C504,1,8503,3,3,9,1,1,12,,1,pos,pos,8,9,Localized,11,1,0,,70,ERposGdk,70,53970,16130,0.0000185,0.000062,0.000062,GdkERpos,1,0,I,1,3,0.1613,4,0,0,1,0,1,,1
00071480_02,2004,2004,0,,,0,,,55,Black,46,C502,2,8500,3,2,3,2,2A,999,,1,dk,dk,8,3,Regional,99,9,0,,55,ERdkG3,55,80490,25690,0.0000124,0.0000389,0.0000389,G3ERdk,1,9,IIA,2,2,0.2569,3,0,0,1,0,2,3,
00071480_03,2004,2004,0,,,0,,,55,Black,46,C502,1,8500,3,3,3,2,2A,999,,1,dk,dk,8,3,Regional,99,9,0,,55,ERdkG3,55,80490,25690,0.0000124,0.0000389,0.0000389,G3ERdk,1,9,IIA,2,2,0.2569,3,0,0,1,0,2,3,
00071908_03,2004,2004,1,1,1,1,,,83,White,38,C508,1,8480,3,3,1,1,1,6,,1,pos,pos,8,1,Localized,11,1,0,,80,ERposG1,80,31730,9310,0.0000315,0.0001074,0.0000315,G1ERpos,0,0,I,1,3,0.3173,4,0,0,1,0,1,1,1
00072168_02,2004,2004,0,,,0,,,75,White,32,C509,2,8480,3,2,9,1,99,45,,1,dk,dk,8,9,Localized,99,9,0,,75,ERdkGdk,75,47680,13150,0.000021,0.000076,0.000021,GdkERdk,0,0,dk,9,3,0.4768,0,98,9,0,9,1,,
00072283_02,2004,2004,1,1,1,1,,,55,Black,40,C509,2,8500,3,2,3,3,3C,13,,1,pos,pos,8,3,Regional,11,1,0,,55,ERposG3,55,80490,25690,0.0000124,0.0000389,0.0000389,G3ERpos,1,1,IIIC,3,2,0.2569,13,10,1,1,1,3,3,1
00072399_02,2004,2004,1,1,1,1,,,62,White,40,C505,1,8500,3,2,1,3,3C,16,,1,pos,pos,8,1,Regional,11,1,0,,60,ERposG1,60,66320,20670,0.0000151,0.0000484,0.0000151,G1ERpos,0,1,IIIC,3,2,0.6632,18,14,1,1,1,3,1,1
00074244_02,2004,2004,0,,,0,,,58,Black,40,C504,1,8522,3,2,2,3,2A,12,,1,dk,dk,8,2,Regional,99,9,0,,55,ERdkG2,55,80490,25690,0.0000124,0.0000389,0.0000389,G2ERdk,1,1,IIA,2,2,0.2569,16,1,1,1,1,3,2,
00074428_02,2004,2004,0,,,0,,,56,White,32,C508,2,8500,3,2,2,1,99,15,,1,dk,dk,8,2,Localized,99,9,0,,55,ERdkG2,55,80490,25690,0.0000124,0.0000389,0.0000124,G2ERdk,0,0,dk,9,2,0.8049001,9,0,0,1,0,1,2,
00074726_02,2004,2004,1,9,9,0,,,57,Black,21,C508,2,8523,3,2,3,1,1,999,,1,dk,dk,8,3,Localized,99,9,0,,55,ERdkG3,55,80490,25690,0.0000124,0.0000389,0.0000389,G3ERdk,1,0,I,1,2,0.2569,10,0,0,1,0,1,3,
00074726_03,2004,2004,1,9,9,0,,,57,Black,21,C508,1,8523,3,3,3,3,2A,999,,1,dk,dk,8,3,Regional,99,9,0,,55,ERdkG3,55,80490,25690,0.0000124,0.0000389,0.0000389,G3ERdk,1,1,IIA,2,2,0.2569,8,1,1,1,1,3,3,
00074872_02,2004,2004,1,9,9,0,,,79,Black,35,C504,2,8500,3,2,9,1,1,999,,1,dk,dk,8,9,Localized,99,9,0,,75,ERdkGdk,75,47680,13150,0.000021,0.000076,0.000076,GdkERdk,1,0,I,1,3,0.1315,9,0,0,1,0,1,,
00075966_02,2004,2004,0,,,0,,,41,Black,36,C509,9,8010,3,2,9,9,99,999,,1,dk,dk,8,9,Dk,99,9,0,,40,ERdkGdk,40,107200,49810,9.33E-06,0.0000201,0.0000201,GdkERdk,1,9,dk,9,1,0.4981,99,99,9,9,9,,,
00076637_03,2004,2004,1,2,2,0,,,52,Black,45,C508,2,8500,3,3,4,1,1,15,,1,neg,neg,8,3,Localized,22,2,0,,50,ERnegG3,50,97630,36030,0.0000102,0.0000278,0.0000278,G3ERneg,1,0,I,1,2,0.3603,0,98,9,0,9,1,4,0
00076860_02,2004,2004,1,1,1,0,,,83,White,10,C508,1,8500,3,2,3,1,2A,25,,1,pos,pos,8,3,Localized,11,1,0,,80,ERposG3,80,31730,9310,0.0000315,0.0001074,0.0000315,G3ERpos,0,0,IIA,2,3,0.3173,15,0,0,1,0,1,3,1
00078649_02,2004,2004,1,8,8,0,,,63,White,23,C504,1,8500,3,2,1,1,1,4,,1,dk,dk,8,1,Localized,99,9,0,,60,ERdkG1,60,66320,20670,0.0000151,0.0000484,0.0000151,G1ERdk,0,0,I,1,2,0.6632,3,0,0,1,0,1,1,
00078880_02,2004,2004,0,,,0,2004,2004,68,White,39,C509,2,8500,3,2,3,3,99,999,1,0,dk,dk,8,3,Regional,99,9,1,0,65,ERdkG3,65,59990,18130,0.0000167,0.0000552,0.0000167,G3ERdk,0,1,dk,9,3,0.5999,11,9,1,1,1,3,3,
00079019_02,2004,2004,1,1,2,0,,,70,White,23,C505,1,8500,3,2,1,1,1,9,,1,pos,neg,8,1,Localized,12,3,0,,70,ERposG1,70,53970,16130,0.0000185,0.000062,0.0000185,G1ERpos,0,0,I,1,3,0.5397,4,0,0,1,0,1,1,1
00079167_02,2004,2004,1,2,2,0,,,75,White,23,C504,1,8520,3,2,9,1,1,7,,1,neg,neg,8,9,Localized,22,2,0,,75,ERnegGdk,75,47680,13150,0.000021,0.000076,0.000021,GdkERneg,0,0,I,1,3,0.4768,11,0,0,1,0,1,,0
00080237_02,2004,2004,1,2,2,0,,,83,Black,24,C509,2,8500,3,2,2,1,99,999,,1,neg,neg,8,2,Localized,22,2,0,,80,ERnegG2,80,31730,9310,0.0000315,0.0001074,0.0001074,G2ERneg,1,0,dk,9,3,0.0931,0,98,9,0,9,1,2,0
00080727_03,2004,2004,1,1,1,0,,,77,White,23,C508,2,8523,3,3,2,1,1,15,,1,pos,pos,8,2,Localized,11,1,0,,75,ERposG2,75,47680,13150,0.000021,0.000076,0.000021,G2ERpos,0,0,I,1,3,0.4768,1,0,0,1,0,1,2,1
00081312_02,2004,2004,1,1,1,0,,,70,White,23,C502,1,8500,3,2,2,1,1,20,,1,pos,pos,8,2,Localized,11,1,0,,70,ERposG2,70,53970,16130,0.0000185,0.000062,0.0000185,G2ERpos,0,0,I,1,3,0.5397,1,0,0,1,0,1,2,1
00081490_02,2004,2004,0,,,0,,,34,White,39,C504,2,8500,3,2,4,3,99,999,,1,dk,dk,8,3,Regional,99,9,0,,30,ERdkG3,30,95250,45580,0.0000105,0.0000219,0.0000105,G3ERdk,0,1,dk,9,1,0.9525,10,2,1,1,1,3,4,
00086245_02,2004,2004,0,,,0,,,73,White,7,C509,2,8500,3,2,2,1,1,999,,1,dk,dk,8,2,Localized,99,9,0,,70,ERdkG2,70,53970,16130,0.0000185,0.000062,0.0000185,G2ERdk,0,0,I,1,3,0.5397,1,0,0,1,0,1,2,
00086264_02,2004,2004,0,,,0,,,70,White,2,C505,2,8500,3,2,2,1,1,999,,1,dk,dk,8,2,Localized,99,9,0,,70,ERdkG2,70,53970,16130,0.0000185,0.000062,0.0000185,G2ERdk,0,0,I,1,3,0.5397,7,0,0,1,0,1,2,
00088273_02,2004,2004,1,9,9,0,,,52,White,26,C504,2,8500,3,2,9,1,2A,27,,1,dk,dk,8,9,Localized,99,9,0,,50,ERdkGdk,50,97630,36030,0.0000102,0.0000278,0.0000102,GdkERdk,0,0,IIA,2,2,0.9763,1,0,0,1,0,1,,
00088556_02,2004,2004,1,0,0,1,,,83,White,32,C508,2,8500,3,2,1,1,1,2,,1,dk,dk,8,1,Localized,99,9,0,,80,ERdkG1,80,31730,9310,0.0000315,0.0001074,0.0000315,G1ERdk,0,0,I,1,3,0.3173,0,98,9,0,9,1,1,
00090585_02,2004,2004,1,2,2,0,,,70,White,42,C508,1,8500,3,2,1,3,2A,12,,1,neg,neg,8,1,Regional,22,2,0,,70,ERnegG1,70,53970,16130,0.0000185,0.000062,0.0000185,G1ERneg,0,1,IIA,2,3,0.5397,1,1,1,1,1,3,1,0
00090705_02,2004,2004,0,,,0,,,74,White,11,C509,2,8500,3,2,3,3,2B,30,,1,dk,dk,8,3,Regional,99,9,0,,70,ERdkG3,70,53970,16130,0.0000185,0.000062,0.0000185,G3ERdk,0,1,IIB,2,3,0.5397,11,2,1,1,1,3,3,
00091111_02,2004,2004,1,2,2,0,,,57,White,23,C509,2,8500,3,2,3,3,2A,20,,1,neg,neg,8,3,Regional,22,2,0,,55,ERnegG3,55,80490,25690,0.0000124,0.0000389,0.0000124,G3ERneg,0,1,IIA,2,2,0.8049001,16,2,1,1,1,3,3,0
00091518_02,2004,2004,1,9,9,0,,,62,White,30,C502,2,8500,3,2,2,4,2A,42,,1,dk,dk,8,2,Regional,99,9,0,,60,ERdkG2,60,66320,20670,0.0000151,0.0000484,0.0000151,G2ERdk,0,1,IIA,2,2,0.6632,1,1,1,1,1,4,2,
00092418_02,2004,2004,1,1,1,0,,,85,White,4,C509,1,8500,3,2,1,1,1,13,,1,pos,pos,8,1,Localized,11,1,0,,85,ERposG1,85,28020,9020,0.0000357,0.0001109,0.0000357,G1ERpos,0,0,I,1,3,0.2802,10,0,0,1,0,1,1,1
00094515_02,2004,2004,0,,,0,,,56,White,2,C504,2,8500,3,2,3,1,2A,999,,1,dk,dk,8,3,Localized,99,9,0,,55,ERdkG3,55,80490,25690,0.0000124,0.0000389,0.0000124,G3ERdk,0,0,IIA,2,2,0.8049001,16,0,0,1,0,1,3,
00096254_02,2004,2004,1,1,2,0,,,51,White,30,C509,2,8500,3,2,1,1,1,999,,1,pos,neg,8,1,Localized,12,3,0,,50,ERposG1,50,97630,36030,0.0000102,0.0000278,0.0000102,G1ERpos,0,0,I,1,2,0.9763,2,0,0,1,0,1,1,1
00096626_02,2004,2004,1,1,2,0,,,76,White,24,C505,1,8520,3,2,1,3,2A,23,,1,pos,neg,8,1,Regional,12,3,0,,75,ERposG1,75,47680,13150,0.000021,0.000076,0.000021,G1ERpos,0,1,IIA,2,3,0.4768,19,3,1,1,1,3,1,1
00096917_02,2004,2004,0,,,0,,,92,White,30,C509,1,8500,3,2,4,1,99,999,,1,dk,dk,8,3,Localized,99,9,0,,90,ERdkG3,85,28020,9020,0.0000357,0.0001109,0.0000357,G3ERdk,0,0,dk,9,3,0.2802,13,0,0,1,0,1,4,
00097572_02,2004,2004,0,,,0,,,59,Black,2,C504,1,8500,3,2,2,1,1,6,,1,dk,dk,8,2,Localized,99,9,0,,55,ERdkG2,55,80490,25690,0.0000124,0.0000389,0.0000389,G2ERdk,1,0,I,1,2,0.2569,1,0,0,1,0,1,2,
00098324_02,2004,2004,0,,,0,,,46,White,46,C504,2,8500,3,2,1,4,2B,999,,1,dk,dk,8,1,Regional,99,9,0,,45,ERdkG1,45,101560,45180,9.85E-06,0.0000221,9.85E-06,G1ERdk,0,1,IIB,2,1,1.0156,11,1,1,1,1,4,1,
00100415_02,2004,2004,1,1,2,0,,,58,White,39,C509,1,8500,3,2,2,1,99,9,,1,pos,neg,8,2,Localized,12,3,0,,55,ERposG2,55,80490,25690,0.0000124,0.0000389,0.0000124,G2ERpos,0,0,dk,9,2,0.8049001,0,98,9,0,9,1,2,1
00101880_02,2004,2004,1,1,1,0,,,47,White,4,C509,1,8500,3,2,2,1,2A,27,,1,pos,pos,8,2,Localized,11,1,0,,45,ERposG2,45,101560,45180,9.85E-06,0.0000221,9.85E-06,G2ERpos,0,0,IIA,2,1,1.0156,11,0,0,1,0,1,2,1
00105926_02,2004,2004,1,1,1,0,,,75,White,4,C509,2,8500,3,2,3,1,1,10,,1,pos,pos,8,3,Localized,11,1,0,,75,ERposG3,75,47680,13150,0.000021,0.000076,0.000021,G3ERpos,0,0,I,1,3,0.4768,9,0,0,1,0,1,3,1
00106902_02,2004,2004,1,1,1,0,,,83,White,22,C505,1,8500,3,2,2,1,1,9,,1,pos,pos,8,2,Localized,11,1,0,,80,ERposG2,80,31730,9310,0.0000315,0.0001074,0.0000315,G2ERpos,0,0,I,1,3,0.3173,12,0,0,1,0,1,2,1
00107583_02,2004,2004,0,,,0,,,70,White,2,C504,2,8520,3,2,2,1,99,999,,1,dk,dk,8,2,Localized,99,9,0,,70,ERdkG2,70,53970,16130,0.0000185,0.000062,0.0000185,G2ERdk,0,0,dk,9,3,0.5397,11,0,0,1,0,1,2,
00107977_02,2004,2004,0,,,0,,,76,White,32,C504,1,8500,3,2,1,1,1,15,,1,dk,dk,8,1,Localized,99,9,0,,75,ERdkG1,75,47680,13150,0.000021,0.000076,0.000021,G1ERdk,0,0,I,1,3,0.4768,6,0,0,1,0,1,1,
00108363_02,2004,2004,1,1,1,1,,,48,Black,36,C504,2,8050,3,2,3,1,1,9,,1,pos,pos,8,3,Localized,11,1,0,,45,ERposG3,45,101560,45180,9.85E-06,0.0000221,0.0000221,G3ERpos,1,0,I,1,1,0.4518,2,0,0,1,0,1,3,1
00108384_02,2004,2004,1,1,2,1,,,65,Black,40,C505,1,8500,3,2,3,1,2B,46,,1,pos,neg,8,3,Localized,12,3,0,,65,ERposG3,65,59990,18130,0.0000167,0.0000552,0.0000552,G3ERpos,1,0,IIB,2,3,0.1813,13,0,0,1,0,1,3,1
00108532_02,2004,2004,1,1,1,1,,,72,White,40,C502,2,8500,3,2,3,1,1,13,,1,pos,pos,8,3,Localized,11,1,0,,70,ERposG3,70,53970,16130,0.0000185,0.000062,0.0000185,G3ERpos,0,0,I,1,3,0.5397,1,0,0,1,0,1,3,1
00110213_02,2004,2004,1,9,9,0,,,64,Black,18,C509,2,8500,3,2,3,1,1,12,,1,dk,dk,8,3,Localized,99,9,0,,60,ERdkG3,60,66320,20670,0.0000151,0.0000484,0.0000484,G3ERdk,1,0,I,1,2,0.2067,2,0,0,1,0,1,3,
00110297_02,2004,2004,1,9,9,0,,,94,White,10,C509,1,8500,3,2,3,1,1,10,,1,dk,dk,8,3,Localized,99,9,0,,90,ERdkG3,85,28020,9020,0.0000357,0.0001109,0.0000357,G3ERdk,0,0,I,1,3,0.2802,14,0,0,1,0,1,3,
00110511_02,2004,2004,1,9,9,0,,,73,White,13,C504,1,8500,3,2,1,1,1,999,,1,dk,dk,8,1,Localized,99,9,0,,70,ERdkG1,70,53970,16130,0.0000185,0.000062,0.0000185,G1ERdk,0,0,I,1,3,0.5397,2,0,0,1,0,1,1,
00110561_02,2004,2004,0,,,0,,,80,White,10,C508,2,8543,3,2,2,2,99,,,1,dk,dk,8,2,Regional,99,9,0,,80,ERdkG2,80,31730,9310,0.0000315,0.0001074,0.0000315,G2ERdk,0,9,dk,9,3,0.3173,6,0,0,1,0,2,2,
00110731_02,2004,2004,1,9,9,0,,,68,White,10,C508,2,8500,3,2,4,1,1,10,,1,dk,dk,8,3,Localized,99,9,0,,65,ERdkG3,65,59990,18130,0.0000167,0.0000552,0.0000167,G3ERdk,0,0,I,1,3,0.5999,0,98,9,0,9,1,4,
00111039_03,2004,2004,1,2,2,0,,,78,White,15,C504,2,8500,3,3,4,2,0,55,,1,neg,neg,8,3,Regional,22,2,0,,75,ERnegG3,75,47680,13150,0.000021,0.000076,0.000021,G3ERneg,0,9,dk,9,3,0.4768,1,0,0,1,0,2,4,0
00111444_02,2004,2004,1,1,2,0,,,83,White,15,C508,1,8520,3,2,3,1,1,3,,1,pos,neg,8,3,Localized,12,3,0,,80,ERposG3,80,31730,9310,0.0000315,0.0001074,0.0000315,G3ERpos,0,0,I,1,3,0.3173,1,0,0,1,0,1,3,1
00111663_02,2004,2004,1,2,2,0,,,46,White,15,C504,2,8500,3,2,4,1,1,70,,1,neg,neg,8,3,Localized,22,2,0,,45,ERnegG3,45,101560,45180,9.85E-06,0.0000221,9.85E-06,G3ERneg,0,0,I,1,1,1.0156,1,0,0,1,0,1,4,0
00111739_02,2004,2004,1,1,1,0,,,79,White,10,C508,2,8522,3,2,2,1,1,20,,1,pos,pos,8,2,Localized,11,1,0,,75,ERposG2,75,47680,13150,0.000021,0.000076,0.000021,G2ERpos,0,0,I,1,3,0.4768,2,0,0,1,0,1,2,1
00112857_02,2004,2004,1,1,1,0,,,46,White,23,C508,1,8500,3,2,2,1,99,7,,1,pos,pos,8,2,Localized,11,1,0,,45,ERposG2,45,101560,45180,9.85E-06,0.0000221,9.85E-06,G2ERpos,0,0,dk,9,1,1.0156,0,98,9,0,9,1,2,1
00112989_02,2004,2004,1,1,2,0,,,56,White,23,C509,1,8500,3,2,1,1,1,6,,1,pos,neg,8,1,Localized,12,3,0,,55,ERposG1,55,80490,25690,0.0000124,0.0000389,0.0000124,G1ERpos,0,0,I,1,2,0.8049001,6,0,0,1,0,1,1,1
00115155_02,2004,2004,1,9,9,0,,,70,White,4,C505,1,8500,3,2,1,2,99,5,,1,dk,dk,8,1,Regional,99,9,0,,70,ERdkG1,70,53970,16130,0.0000185,0.000062,0.0000185,G1ERdk,0,9,dk,9,3,0.5397,0,98,9,0,9,2,1,
00115748_02,2004,2004,0,,,0,2004,2004,63,White,39,C509,1,8500,3,2,3,4,99,999,0,0,dk,dk,8,3,Regional,99,9,2,0,60,ERdkG3,60,66320,20670,0.0000151,0.0000484,0.0000151,G3ERdk,0,1,dk,9,2,0.6632,10,3,1,1,1,4,3,
00117128_02,2004,2004,1,2,2,0,,,84,Black,10,C502,2,8500,3,2,4,2,2A,30,,1,neg,neg,8,3,Regional,22,2,0,,80,ERnegG3,80,31730,9310,0.0000315,0.0001074,0.0001074,G3ERneg,1,9,IIA,2,3,0.0931,1,0,0,1,0,2,4,0
00117304_02,2004,2004,1,2,2,0,,,50,White,10,C504,2,8500,3,2,3,1,1,10,,1,neg,neg,8,3,Localized,22,2,0,,50,ERnegG3,50,97630,36030,0.0000102,0.0000278,0.0000102,G3ERneg,0,0,I,1,2,0.9763,1,0,0,1,0,1,3,0